{"text_format":"1","workbook":"xlsx","n_sheets":4,"sheets":["INGRESO DE DATOS","Global Elite","Resumen tarifas","Tablas"],"not_rendered":{"charts":0,"images":4,"macros":1,"external_links":0,"defined_names":3,"comments":1,"pivot_tables":0},"unopened":[],"bounds":{"document_bytes":16777216,"sheet_cells":100000,"rows_first":2000,"rows_last":500,"rows_between":2000,"halvings":0,"cell_chars":16384,"cell_head_chars":4096},"cells_cut":0,"cells_raw":0,"read":"whole","date_system":"1900"}

{"sheet":"INGRESO DE DATOS","index":0,"n_rows":25,"n_cols":11,"rows_kept":25,"cut":false,"hidden":false,"merged":[[22,3,22,4],[22,8,22,9],[16,5,16,8],[12,1,12,2],[14,1,14,2],[12,3,12,9],[14,5,14,8],[16,1,16,2],[19,3,19,6]]}
[]
[null,null,null,null,null,null,null,null,null," "," "]
[]
[]
[]
[]
[]
[]
[]
[]
[]
[]
[null,"Nombre del Asegurado Titular",null,"NOMBRE COMPLETO"]
[]
[null,"Número de adultos en la póliza",null,2,null,"Número de niños en la póliza",null,null,null,2]
[]
[null,"Edad del Asegurado Titular",null,32,null,"Edad del/la cónyuge ",null,null,null,46]
[]
[]
[null,null,null," Variante con coaseguro fuera del país de residencia",null,null,null,false,null,false]
[]
[]
[]
[]
[null,1,null,1]

{"sheet":"Global Elite","index":1,"n_rows":79,"n_cols":11,"rows_kept":79,"cut":false,"hidden":false,"merged":[[38,4,38,10],[44,1,45,1],[44,0,45,0],[19,3,19,4],[15,3,15,4],[17,3,17,4],[15,0,15,1],[15,5,15,10],[23,4,23,5],[21,3,22,4],[32,4,32,5],[27,4,27,10],[51,4,51,10],[64,4,64,10],[78,4,79,10],[76,4,76,10],[36,4,36,5],[49,4,49,5],[62,4,62,5],[55,4,55,5],[57,4,57,5],[77,4,77,10],[43,4,43,5],[56,4,56,5],[68,4,68,5],[69,4,69,5],[70,4,70,5],[75,4,75,5]]}
[]
[]
[null,null,null,null,null,null,null," "," "," "]
[]
[]
[]
[null,null,null,null,null,null,null," "," "," "]
[]
[]
[]
[]
[]
[]
[]
[]
["GLOBAL ELITE HEALTH PLAN",null,null,"Nombre del Asegurado Titular",null,{"$f":"+'INGRESO DE DATOS'!$D$13","v":"NOMBRE COMPLETO"}]
[]
[null,null,null,"Número de adultos en la póliza",null,{"$f":"+'INGRESO DE DATOS'!$D$15","v":2},null,null,"Edad del Asegurado Titular",{"$f":"+'INGRESO DE DATOS'!$D$17","v":32}]
[]
[null,null,null,"Número de niños en la póliza",null,{"$f":"+'INGRESO DE DATOS'!$J$15","v":2},null,null,"Edad del/la conyuge",{"$f":"+'INGRESO DE DATOS'!$J$17","v":46}]
[null,null,null,null,null,null,null," "," "]
[null,null,null,"Número de niños menores de 10 años",null,{"$f":"+'INGRESO DE DATOS'!$D$25","v":1},null,null,"Fecha de la cotización:",{"$f":"NOW()","v":"2023-07-27T10:54:55.150"}]
[null,null,null,null,null,null," ",false,null," "]
[null,null,null,null,"DEDUCTIBLES",null,"PLAN 1","PLAN 2","PLAN 3","PLAN 4","PLAN 5"]
[null,null,null,null,"En el país de residencia",null,250,2000,3500,5000,10000]
[null,null,null,null,"Fuera del país de residencia",null,5000,2000,3500,5000,10000]
[]
[null,null,null,null,"Tarifas anuales"]
[null,null,null,null,"Prima para Asegurado Titular",null,{"$f":"(VLOOKUP($J$18,Tablas!$A$6:$G$72,3,TRUE))","v":5981.920000000001},{"$f":"(VLOOKUP($J$18,Tablas!$A$6:$G$72,4,TRUE))","v":5243.2800000000007},{"$f":"(VLOOKUP($J$18,Tablas!$A$6:$G$72,5,TRUE))","v":4349.5200000000004},{"$f":"(VLOOKUP($J$18,Tablas!$A$6:$G$72,6,TRUE))","v":3771.0400000000004},{"$f":"(VLOOKUP($J$18,Tablas!$A$6:$G$72,7,TRUE))","v":2925.44}]
[null,null,null,null,"Prima para conyuge",null,{"$f":"(IF($F$18=1,0,(VLOOKUP($J$20,Tablas!$A$6:$G$72,3,TRUE))))","v":8372},{"$f":"(IF($F$18=1,0,(VLOOKUP($J$20,Tablas!$A$6:$G$72,4,TRUE))))","v":7339.3600000000006},{"$f":"(IF($F$18=1,0,(VLOOKUP($J$20,Tablas!$A$6:$G$72,5,TRUE))))","v":6009.3600000000006},{"$f":"(IF($F$18=1,0,(VLOOKUP($J$20,Tablas!$A$6:$G$72,6,TRUE))))","v":5210.8},{"$f":"(IF($F$18=1,0,(VLOOKUP($J$20,Tablas!$A$6:$G$72,7,TRUE))))","v":4041.5200000000004}]
{"$rows_left_out":50}
{"sheet":"Resumen tarifas","index":2,"n_rows":131,"n_cols":8,"rows_kept":131,"cut":false,"hidden":false,"merged":[[52,2,52,3],[70,3,70,7],[87,4,87,7],[103,4,103,7],[120,2,120,3],[97,4,97,7],[61,3,61,7],[63,3,63,7],[66,3,66,7],[79,4,79,7],[81,4,81,7],[84,4,84,7],[95,4,95,7],[69,0,69,2],[84,0,84,1],[92,0,92,1],[128,0,128,7],[129,0,129,7],[130,0,132,7],[109,0,109,1],[112,0,112,1],[115,0,115,1],[126,0,126,1],[114,2,114,3],[118,0,118,1],[114,0,114,1],[113,0,113,1],[97,0,97,1],[108,0,108,2],[112,2,112,3],[101,0,101,1],[98,0,98,1],[100,0,100,1],[45,2,45,3],[48,2,48,3],[117,2,117,3],[117,0,117,1],[95,0,95,1],[63,0,63,1],[85,0,85,1],[79,0,79,1],[80,0,80,1],[81,0,81,1],[82,0,82,1],[64,0,64,1],[66,0,66,1],[67,0,67,1],[76,0,76,1],[96,0,96,1],[62,0,62,1],[100,4,100,7],[26,0,26,6],[57,0,57,1],[28,2,28,6],[31,4,31,5],[34,4,34,5],[39,0,39,1],[40,0,40,1],[43,0,43,1],[44,0,44,1],[45,0,45,1],[46,0,46,1],[48,0,48,1],[51,0,51,1],[43,2,43,3],[61,0,61,1],[49,0,49,1],[28,0,28,1],[31,0,31,1],[34,0,34,1],[58,0,58,1]]}
[]
[null,null,null,null," "," "]
[]
[]
[]
[]
[]
[]
[]
[null,null,null,null," "," "," "]
[]
[]
[]
[]
[]
[]
[]
[]
[]
[]
[]
[]
[]
[]
[]
[]
["Cotizador de Seguro Médico - Bupa Global Health Plans"]
[]
["Nombre del Asegurado Titular",null,{"$f":"+'INGRESO DE DATOS'!$D$13","v":"NOMBRE COMPLETO"}]
[]
{"$rows_left_out":102}
{"sheet":"Tablas","index":3,"n_rows":1497,"n_cols":19,"rows_kept":1497,"cut":false,"hidden":true,"merged":[[1424,0,1424,6],[1425,0,1425,1],[1425,2,1425,6],[1348,0,1348,6],[1349,0,1349,6],[1350,0,1350,1],[1350,2,1350,6],[1423,0,1423,6],[1200,0,1200,1],[1200,2,1200,6],[1273,0,1273,6],[1274,0,1274,6],[1275,0,1275,1],[1275,2,1275,6],[1124,0,1124,6],[1125,0,1125,6],[1126,0,1126,1],[1126,2,1126,6],[1199,0,1199,6],[976,0,976,1],[976,2,976,6],[1049,0,1049,6],[1050,0,1050,6],[1051,0,1051,1],[1051,2,1051,6],[900,0,900,6],[901,0,901,6],[902,0,902,1],[902,2,902,6],[975,0,975,6],[1,0,1,6],[2,0,2,6],[77,0,77,1],[77,2,77,6],[76,0,76,6],[3,0,3,1],[3,2,3,6],[376,0,376,1],[376,2,376,6],[150,0,150,6],[151,0,151,6],[152,0,152,1],[152,2,152,6],[225,0,225,6],[226,0,226,1],[375,0,375,6],[226,2,226,6],[300,0,300,6],[301,0,301,6],[302,0,302,1],[302,2,302,6],[526,0,526,6],[450,0,450,6],[451,0,451,6],[452,0,452,1],[452,2,452,6],[525,0,525,6],[527,0,527,1],[527,2,527,6],[600,0,600,6],[601,0,601,6],[602,0,602,1],[602,2,602,6],[751,0,751,6],[675,0,675,6],[676,0,676,6],[677,0,677,1],[677,2,677,6],[750,0,750,6],[752,0,752,1],[752,2,752,6],[825,0,825,6],[826,0,826,6],[827,0,827,1],[827,2,827,6]]}
[]
["BUPA GLOBAL ELITE",null,null,null,null,null,null,null,"FACTOR MENSUAL:",null,{"$f":"1.12/12","v":9.3333333333333338E-2},null,{"$f":"1.12/12","v":9.3333333333333338E-2}]
["TARIFAS ANUALES",null,null,null,null,null,null,null,"FACTOR TRIMESTRAL:",null,0.27500000000000002,null,{"$f":"1.1/4","v":0.27500000000000002}]
["EDAD",null,null,null,null,null,null,null,"FACTOR SEMIANUAL:",null,0.53,null,{"$f":"1.06/2","v":0.53}]
[" "," ",250,2000,3500,5000,10000,null,"Descuento (20%):",null,{"$f":"100%-20%","v":0.8},null,{"$f":"100%-20%","v":0.8}]
[18,null,{"$f":"O6","v":5032.1600000000008},{"$f":"P6","v":4409.4400000000005},3708.8800000000006,3216.6400000000003,2494.8000000000002,null,8986,7874,6623,5744,4455,null,{"$f":"I6*0.56","v":5032.1600000000008},{"$f":"J6*0.56","v":4409.4400000000005},3708.8800000000006,3216.6400000000003,2494.8000000000002]
[19,null,{"$f":"O7","v":5032.1600000000008},{"$f":"P7","v":4409.4400000000005},{"$f":"Q7","v":3708.8800000000006},{"$f":"R7","v":3216.6400000000003},{"$f":"S7","v":2494.8000000000002},null,8986,7874,6623,5744,4455,null,{"$f":"I7*0.56","v":5032.1600000000008},{"$f":"J7*0.56","v":4409.4400000000005},{"$f":"K7*0.56","v":3708.8800000000006},{"$f":"L7*0.56","v":3216.6400000000003},{"$f":"M7*0.56","v":2494.8000000000002}]
[20,null,5032.1600000000008,4409.4400000000005,3708.8800000000006,3216.6400000000003,2494.8000000000002,null,8986,7874,6623,5744,4455,null,5032.1600000000008,4409.4400000000005,3708.8800000000006,3216.6400000000003,2494.8000000000002]
[21,null,5032.1600000000008,4409.4400000000005,3708.8800000000006,3216.6400000000003,2494.8000000000002,null,8986,7874,6623,5744,4455,null,5032.1600000000008,4409.4400000000005,3708.8800000000006,3216.6400000000003,2494.8000000000002]
[22,null,5032.1600000000008,4409.4400000000005,3708.8800000000006,3216.6400000000003,2494.8000000000002,null,8986,7874,6623,5744,4455,null,5032.1600000000008,4409.4400000000005,3708.8800000000006,3216.6400000000003,2494.8000000000002]
[23,null,5032.1600000000008,4409.4400000000005,3708.8800000000006,3216.6400000000003,2494.8000000000002,null,8986,7874,6623,5744,4455,null,5032.1600000000008,4409.4400000000005,3708.8800000000006,3216.6400000000003,2494.8000000000002]
[24,null,5032.1600000000008,4409.4400000000005,3708.8800000000006,3216.6400000000003,2494.8000000000002,null,8986,7874,6623,5744,4455,null,5032.1600000000008,4409.4400000000005,3708.8800000000006,3216.6400000000003,2494.8000000000002]
[25,null,5377.68,4713.5200000000004,3940.7200000000003,3417.1200000000003,2650.4800000000005,null,9603,8417,7037,6102,4733,null,5377.68,4713.5200000000004,3940.7200000000003,3417.1200000000003,2650.4800000000005]
[26,null,5377.68,4713.5200000000004,3940.7200000000003,3417.1200000000003,2650.4800000000005,null,9603,8417,7037,6102,4733,null,5377.68,4713.5200000000004,3940.7200000000003,3417.1200000000003,2650.4800000000005]
[27,null,5377.68,4713.5200000000004,3940.7200000000003,3417.1200000000003,2650.4800000000005,null,9603,8417,7037,6102,4733,null,5377.68,4713.5200000000004,3940.7200000000003,3417.1200000000003,2650.4800000000005]
[28,null,5377.68,4713.5200000000004,3940.7200000000003,3417.1200000000003,2650.4800000000005,null,9603,8417,7037,6102,4733,null,5377.68,4713.5200000000004,3940.7200000000003,3417.1200000000003,2650.4800000000005]
[29,null,5377.68,4713.5200000000004,3940.7200000000003,3417.1200000000003,2650.4800000000005,null,9603,8417,7037,6102,4733,null,5377.68,4713.5200000000004,3940.7200000000003,3417.1200000000003,2650.4800000000005]
[30,null,5981.920000000001,5243.2800000000007,4349.5200000000004,3771.0400000000004,2925.44,null,10682,9363,7767,6734,5224,null,5981.920000000001,5243.2800000000007,4349.5200000000004,3771.0400000000004,2925.44]
[31,null,5981.920000000001,5243.2800000000007,4349.5200000000004,3771.0400000000004,2925.44,null,10682,9363,7767,6734,5224,null,5981.920000000001,5243.2800000000007,4349.5200000000004,3771.0400000000004,2925.44]
[32,null,5981.920000000001,5243.2800000000007,4349.5200000000004,3771.0400000000004,2925.44,null,10682,9363,7767,6734,5224,null,5981.920000000001,5243.2800000000007,4349.5200000000004,3771.0400000000004,2925.44]
[33,null,5981.920000000001,5243.2800000000007,4349.5200000000004,3771.0400000000004,2925.44,null,10682,9363,7767,6734,5224,null,5981.920000000001,5243.2800000000007,4349.5200000000004,3771.0400000000004,2925.44]
[34,null,5981.920000000001,5243.2800000000007,4349.5200000000004,3771.0400000000004,2925.44,null,10682,9363,7767,6734,5224,null,5981.920000000001,5243.2800000000007,4349.5200000000004,3771.0400000000004,2925.44]
[35,null,6678.0000000000009,5853.1200000000008,4828.3200000000006,4186,3246.88,null,11925,10452,8622,7475,5798,null,6678.0000000000009,5853.1200000000008,4828.3200000000006,4186,3246.88]
[36,null,6678.0000000000009,5853.1200000000008,4828.3200000000006,4186,3246.88,null,11925,10452,8622,7475,5798,null,6678.0000000000009,5853.1200000000008,4828.3200000000006,4186,3246.88]
[37,null,6678.0000000000009,5853.1200000000008,4828.3200000000006,4186,3246.88,null,11925,10452,8622,7475,5798,null,6678.0000000000009,5853.1200000000008,4828.3200000000006,4186,3246.88]
[38,null,6678.0000000000009,5853.1200000000008,4828.3200000000006,4186,3246.88,null,11925,10452,8622,7475,5798,null,6678.0000000000009,5853.1200000000008,4828.3200000000006,4186,3246.88]
[39,null,6678.0000000000009,5853.1200000000008,4828.3200000000006,4186,3246.88,null,11925,10452,8622,7475,5798,null,6678.0000000000009,5853.1200000000008,4828.3200000000006,4186,3246.88]
[40,null,7482.1600000000008,6557.0400000000009,5384.9600000000009,4669.2800000000007,3621.5200000000004,null,13361,11709,9616,8338,6467,null,7482.1600000000008,6557.0400000000009,5384.9600000000009,4669.2800000000007,3621.5200000000004]
[41,null,7482.1600000000008,6557.0400000000009,5384.9600000000009,4669.2800000000007,3621.5200000000004,null,13361,11709,9616,8338,6467,null,7482.1600000000008,6557.0400000000009,5384.9600000000009,4669.2800000000007,3621.5200000000004]
[42,null,7482.1600000000008,6557.0400000000009,5384.9600000000009,4669.2800000000007,3621.5200000000004,null,13361,11709,9616,8338,6467,null,7482.1600000000008,6557.0400000000009,5384.9600000000009,4669.2800000000007,3621.5200000000004]
{"$rows_left_out":1467}