{"text_format":"1","workbook":"xlsx","n_sheets":4,"sheets":["INGRESO DE DATOS","Essential Care","Resumen tarifas anuales","Tablas"],"not_rendered":{"charts":0,"images":4,"macros":1,"external_links":0,"defined_names":2,"comments":1,"pivot_tables":0},"unopened":[],"bounds":{"document_bytes":16777216,"sheet_cells":100000,"rows_first":2000,"rows_last":500,"rows_between":2000,"halvings":0,"cell_chars":16384,"cell_head_chars":4096},"cells_cut":0,"cells_raw":0,"read":"whole","date_system":"1900"}

{"sheet":"INGRESO DE DATOS","index":0,"n_rows":29,"n_cols":12,"rows_kept":29,"cut":false,"hidden":false,"merged":[[7,0,7,9],[24,3,24,9],[17,7,17,8],[13,3,13,9],[15,3,15,5],[15,7,15,8],[8,0,8,9]]}
[]
[]
[]
[]
[]
[]
[]
[]
[]
[null,null,null,null,null,null,null,null,null,null," "]
[]
["INGRESE LOS DATOS DEL PROPUESTO ASEGURADO:"]
[]
[null,null,"Nombre del Asegurado Principal:","Nombre"]
[null,null,null,null,null,null,null,null,null,null," "," "]
[null,null,null,"Número de Adultos:",null,null,1,"Número de Hijos:",null,0]
[]
[null,null,null,null,null," Edad de Titular:",40,"Edad de Cónyuge:",null,46]
[]
[null,null,null,null,null,"Descuento:",0]
[]
[]
["INGRESE EL NOMBRE DE LA AGENCIA ASESORA:"]
[]
[null,null,"Intermediario:","Agente / Agencia"]
[]
[]
[]
["ESCOJA EL PRODUCTO PARA VISUALIZAR LA COTIZACION RESPECTIVA:"]

{"sheet":"Essential Care","index":1,"n_rows":83,"n_cols":11,"rows_kept":83,"cut":false,"hidden":false,"merged":[[70,0,70,1],[71,0,71,1],[30,0,30,1],[30,3,30,9],[43,3,43,9],[55,0,55,1],[36,0,36,1],[41,0,41,1],[10,0,10,1],[16,0,16,1],[22,0,22,1],[9,0,9,1],[69,0,69,1],[8,3,8,9],[7,3,7,9],[80,3,80,9],[81,3,81,9],[82,3,82,9],[10,4,10,9],[12,4,12,9],[76,3,78,9],[59,3,59,9],[75,3,75,9],[25,3,25,9]]}
[]
[]
[]
[]
[]
[]
[]
[null,null,null,"Cotización de Seguro Médico Internacional"]
[null,null,null,"BUPA Essential Care"]
["Bupa Essential Care",null,null,null,null,null,null," "," "," "," "]
[null,null,null,"Nombre del Asegurado:",{"$f":"+'INGRESO DE DATOS'!$D$14","v":"Nombre"}]
[]
[null,null,null,"Intermediario:",{"$f":"+'INGRESO DE DATOS'!$D$25","v":"Agente / Agencia"}]
[]
[null,null,null,"Fecha:",{"$f":"+TODAY()","v":"2023-07-25"},null,{"$f":"IF('INGRESO DE DATOS'!G20>0,\"Descuento\",\"\")","v":""},{"$f":"IF('INGRESO DE DATOS'!G20>0,'INGRESO DE DATOS'!G20,\"\")","v":""}]
[]
[null,null,null,null,null,"Numero de Adultos:",{"$f":"+'INGRESO DE DATOS'!$G$16","v":1},null,"Edad de Titular:",{"$f":"+'INGRESO DE DATOS'!$G$18","v":40}]
[]
[null,null,null,null,null,"Numero de Hijos:",{"$f":"+'INGRESO DE DATOS'!$J$16","v":0},null,"Edad de Conyuge:",{"$f":"+'INGRESO DE DATOS'!$J$18","v":46}]
[null,null,null,null,null,null," "," "," "]
[null,null,null,null,null,null,null,"Complicaciones de Maternidad (planes 1, 2, y 3)"]
[null,null,null,null,null,true]
[null,null,null,null,null,true,null,"Trasplante de Órganos"]
[null,null,null,null,null,false]
[null,null,null," ",null,null,null,"Eliminación de Deducible"]
[null,null,null,"Deducibles"]
[null,null,null,null,"PLAN 1","PLAN 2","PLAN 3","PLAN 4","PLAN 5","PLAN 6"]
[null,null,null,"Dentro del pais de residencia",250,250,1000,5000,10000,20000]
[null,null,null,"Fuera del pais de residencia",1000,5000,10000,5000,10000,20000]
[]
[null,null,null,"Tarifas Anuales"]
[null,null,null,"Prima Titular",{"$f":"VLOOKUP($J$17,Tablas!$A$274:$H$336,3,TRUE)","v":1769.76},{"$f":"VLOOKUP($J$17,Tablas!$A$274:$H$336,4,TRUE)","v":1701.36},{"$f":"VLOOKUP($J$17,Tablas!$A$274:$H$336,5,TRUE)","v":1578.24},{"$f":"VLOOKUP($J$17,Tablas!$A$274:$H$336,6,TRUE)","v":1116.72},{"$f":"VLOOKUP($J$17,Tablas!$A$274:$H$336,7,TRUE)","v":802.8},{"$f":"VLOOKUP($J$17,Tablas!$A$274:$H$336,8,TRUE)","v":565.91999999999996}]
[null,null,null,"Prima Cónyuge",{"$f":"IF($G$17=1,0,(VLOOKUP($J$19,Tablas!$A$274:$H$336,3,TRUE)))","v":0},{"$f":"IF($G$17=1,0,(VLOOKUP($J$19,Tablas!$A$274:$H$336,4,TRUE)))","v":0},{"$f":"IF($G$17=1,0,(VLOOKUP($J$19,Tablas!$A$274:$H$336,5,TRUE)))","v":0},{"$f":"IF($G$17=1,0,(VLOOKUP($J$19,Tablas!$A$274:$H$336,6,TRUE)))","v":0},{"$f":"IF($G$17=1,0,(VLOOKUP($J$19,Tablas!$A$274:$H$336,7,TRUE)))","v":0},{"$f":"IF($G$17=1,0,(VLOOKUP($J$19,Tablas!$A$274:$H$336,8,TRUE)))","v":0}]
[null,null,null,"Primas Hijos",{"$f":"IF($G$19=0,0,(VLOOKUP($G$19,Tablas!$A$337:$H$339,3,TRUE)))","v":0},{"$f":"IF($G$19=0,0,(VLOOKUP($G$19,Tablas!$A$337:$H$339,4,TRUE)))","v":0},{"$f":"IF($G$19=0,0,(VLOOKUP($G$19,Tablas!$A$337:$H$339,5,TRUE)))","v":0},{"$f":"IF($G$19=0,0,(VLOOKUP($G$19,Tablas!$A$337:$H$339,6,TRUE)))","v":0},{"$f":"IF($G$19=0,0,(VLOOKUP($G$19,Tablas!$A$337:$H$339,7,TRUE)))","v":0},{"$f":"IF($G$19=0,0,(VLOOKUP($G$19,Tablas!$A$337:$H$339,8,TRUE)))","v":0}]
[null,null,null,"Anexo: Complicaciones de Maternidad",{"$f":"+IF($F$22=FALSE,0,Tablas!C$340)","v":225},{"$f":"+IF($F$22=FALSE,0,Tablas!D$340)","v":225},{"$f":"+IF($F$22=FALSE,0,Tablas!E$340)","v":225},{"$f":"+IF($F$22=FALSE,0,Tablas!F$340)","v":0},{"$f":"+IF($F$22=FALSE,0,Tablas!G$340)","v":0},{"$f":"+IF($F$22=FALSE,0,Tablas!H$340)","v":0}]
[null,null,null,"Anexo: Trasplante Organos",{"$f":"IF($F$23=FALSE,0,Tablas!C$341)","v":300},{"$f":"IF($F$23=FALSE,0,Tablas!D$341)","v":300},{"$f":"IF($F$23=FALSE,0,Tablas!E$341)","v":300},{"$f":"IF($F$23=FALSE,0,Tablas!F$341)","v":300},{"$f":"IF($F$23=FALSE,0,Tablas!G$341)","v":300},{"$f":"IF($F$23=FALSE,0,Tablas!H$341)","v":300}]
[null,null,null,"Anexo: Eliminacion de Deducible",{"$f":"IF($F$24=FALSE,0,Tablas!C$342)","v":0},{"$f":"IF($F$24=FALSE,0,Tablas!D$342)","v":0},{"$f":"IF($F$24=FALSE,0,Tablas!E$342)","v":0},{"$f":"IF($F$24=FALSE,0,Tablas!F$342)","v":0},{"$f":"IF($F$24=FALSE,0,Tablas!G$342)","v":0},{"$f":"IF($F$24=FALSE,0,Tablas!H$342)","v":0}]
[null,null,null,"PRIMA NETA",{"$f":"SUM(E32:E37)","v":2294.7600000000002},2226.3599999999997,2103.2399999999998,1416.72,1102.8,865.92]
[null,null,null,{"$f":"IF('INGRESO DE DATOS'!G20>0,\"Descuento\",\"\")","v":""},{"$f":"IF('INGRESO DE DATOS'!$G$20>0,-(E32+E33+E34)*'INGRESO DE DATOS'!$G$20,0)","v":0},{"$f":"IF('INGRESO DE DATOS'!$G$20>0,-(F32+F33+F34)*'INGRESO DE DATOS'!$G$20,0)","v":0},{"$f":"IF('INGRESO DE DATOS'!$G$20>0,-(G32+G33+G34)*'INGRESO DE DATOS'!$G$20,0)","v":0},{"$f":"IF('INGRESO DE DATOS'!$G$20>0,-(H32+H33+H34)*'INGRESO DE DATOS'!$G$20,0)","v":0},{"$f":"IF('INGRESO DE DATOS'!$G$20>0,-(I32+I33+I34)*'INGRESO DE DATOS'!$G$20,0)","v":0},{"$f":"IF('INGRESO DE DATOS'!$G$20>0,-(J32+J33+J34)*'INGRESO DE DATOS'!$G$20,0)","v":0}]
[null,null,null,"Costo Administrativo Anual",75,75,75,75,75,75]
[null,null,null,"IVA (12%)",{"$f":"+(E38+E39+E40)*12%","v":284.37119999999999},{"$f":"+(F38+F39+F40)*12%","v":276.16319999999996},{"$f":"+(G38+G39+G40)*12%","v":261.38879999999995},179.00639999999999,141.33599999999998,{"$f":"+(J38+J39+J40)*12%","v":112.9104}]
[null,null,null,"TOTAL",{"$f":"SUM(E38:E41)","v":2654.1312000000003},2577.5231999999996,2439.6287999999995,1670.7264,1319.136,1053.8304000000001]
[]
[null,null,null,"Tarifas Semestrales"]
[null,null,null,"Prima Titular",{"$f":"VLOOKUP($J$17,Tablas!$A$346:$H$408,3,TRUE)","v":937.97280000000001},{"$f":"VLOOKUP($J$17,Tablas!$A$346:$H$408,4,TRUE)","v":901.72079999999994},{"$f":"VLOOKUP($J$17,Tablas!$A$346:$H$408,5,TRUE)","v":836.46720000000005},{"$f":"VLOOKUP($J$17,Tablas!$A$346:$H$408,6,TRUE)","v":591.86160000000007},{"$f":"VLOOKUP($J$17,Tablas!$A$346:$H$408,7,TRUE)","v":425.48399999999998},{"$f":"VLOOKUP($J$17,Tablas!$A$346:$H$408,8,TRUE)","v":299.93759999999997}]
[null,null,null,"Prima Cónyuge",{"$f":"IF($G$17=1,0,(VLOOKUP($J$19,Tablas!$A$346:$H$408,3,TRUE)))","v":0},{"$f":"IF($G$17=1,0,(VLOOKUP($J$19,Tablas!$A$346:$H$408,4,TRUE)))","v":0},{"$f":"IF($G$17=1,0,(VLOOKUP($J$19,Tablas!$A$346:$H$408,5,TRUE)))","v":0},{"$f":"IF($G$17=1,0,(VLOOKUP($J$19,Tablas!$A$346:$H$408,6,TRUE)))","v":0},{"$f":"IF($G$17=1,0,(VLOOKUP($J$19,Tablas!$A$346:$H$408,7,TRUE)))","v":0},{"$f":"IF($G$17=1,0,(VLOOKUP($J$19,Tablas!$A$346:$H$408,8,TRUE)))","v":0}]
[null,null,null,"Primas Hijos",{"$f":"IF($G$19=0,0,(VLOOKUP($G$19,Tablas!$A$409:$H$411,3,TRUE)))","v":0},{"$f":"IF($G$19=0,0,(VLOOKUP($G$19,Tablas!$A$409:$H$411,4,TRUE)))","v":0},{"$f":"IF($G$19=0,0,(VLOOKUP($G$19,Tablas!$A$409:$H$411,5,TRUE)))","v":0},{"$f":"IF($G$19=0,0,(VLOOKUP($G$19,Tablas!$A$409:$H$411,6,TRUE)))","v":0},{"$f":"IF($G$19=0,0,(VLOOKUP($G$19,Tablas!$A$409:$H$411,7,TRUE)))","v":0},{"$f":"IF($G$19=0,0,(VLOOKUP($G$19,Tablas!$A$409:$H$411,8,TRUE)))","v":0}]
[null,null,null,"Anexo: Complicaciones de Maternidad",{"$f":"+IF($F$22=FALSE,0,Tablas!C$412)","v":119.25},{"$f":"+IF($F$22=FALSE,0,Tablas!D$412)","v":119.25},{"$f":"+IF($F$22=FALSE,0,Tablas!E$412)","v":119.25},{"$f":"+IF($F$22=FALSE,0,Tablas!F$412)","v":0},{"$f":"+IF($F$22=FALSE,0,Tablas!G$412)","v":0},{"$f":"+IF($F$22=FALSE,0,Tablas!H$412)","v":0}]
[null,null,null,"Anexo: Trasplante Organos",{"$f":"IF($F$23=FALSE,0,Tablas!C$413)","v":159},{"$f":"IF($F$23=FALSE,0,Tablas!D$413)","v":159},{"$f":"IF($F$23=FALSE,0,Tablas!E$413)","v":159},{"$f":"IF($F$23=FALSE,0,Tablas!F$413)","v":159},{"$f":"IF($F$23=FALSE,0,Tablas!G$413)","v":159},{"$f":"IF($F$23=FALSE,0,Tablas!H$413)","v":159}]
[null,null,null,"Anexo: Eliminacion de Deducible",{"$f":"IF($F$24=FALSE,0,Tablas!C$414)","v":0},{"$f":"IF($F$24=FALSE,0,Tablas!D$414)","v":0},{"$f":"IF($F$24=FALSE,0,Tablas!E$414)","v":0},{"$f":"IF($F$24=FALSE,0,Tablas!F$414)","v":0},{"$f":"IF($F$24=FALSE,0,Tablas!G$414)","v":0},{"$f":"IF($F$24=FALSE,0,Tablas!H$414)","v":0}]
[null,null,null,"PRIMA NETA",{"$f":"SUM(E45:E50)","v":1216.2228},{"$f":"SUM(F45:F50)","v":1179.9708000000001},{"$f":"SUM(G45:G50)","v":1114.7172},750.86160000000007,584.48399999999992,458.93759999999997]
[null,null,null,{"$f":"IF('INGRESO DE DATOS'!G20>0,\"Descuento\",\"\")","v":""},{"$f":"IF('INGRESO DE DATOS'!$G$20>0,-(E45+E46+E47)*'INGRESO DE DATOS'!$G$20,0)","v":0},{"$f":"IF('INGRESO DE DATOS'!$G$20>0,-(F45+F46+F47)*'INGRESO DE DATOS'!$G$20,0)","v":0},{"$f":"IF('INGRESO DE DATOS'!$G$20>0,-(G45+G46+G47)*'INGRESO DE DATOS'!$G$20,0)","v":0},{"$f":"IF('INGRESO DE DATOS'!$G$20>0,-(H45+H46+H47)*'INGRESO DE DATOS'!$G$20,0)","v":0},{"$f":"IF('INGRESO DE DATOS'!$G$20>0,-(I45+I46+I47)*'INGRESO DE DATOS'!$G$20,0)","v":0},{"$f":"IF('INGRESO DE DATOS'!$G$20>0,-(J45+J46+J47)*'INGRESO DE DATOS'!$G$20,0)","v":0}]
[null,null,null,"Costo Administrativo Anual",75,75,75,75,75,75]
[null,null,null,"IVA (12%)",{"$f":"+(E51+E52+E53)*12%","v":154.94673599999999},{"$f":"+(F51+F52+F53)*12%","v":150.596496},{"$f":"+(G51+G52+G53)*12%","v":142.766064},{"$f":"+(H51+H52+H53)*12%","v":99.103391999999999},{"$f":"+(I51+I52+I53)*12%","v":79.138079999999988},{"$f":"+(J51+J52+J53)*12%","v":64.072511999999989}]
[null,null,null,"(1ra Cuota)",{"$f":"SUM(E51:E54)","v":1446.1695359999999},1405.5672960000002,1332.483264,924.96499200000005,738.62207999999987,598.01011199999994]
[null,null,null,"(2da Cuota)",{"$f":"E51+E52+E54-(E53*0.12)","v":1362.1695359999999},{"$f":"F51+F52+F54-(F53*0.12)","v":1321.5672960000002},{"$f":"G51+G52+G54-(G53*0.12)","v":1248.483264},840.96499200000005,654.62207999999987,514.01011199999994]
[null,null,null,"TOTAL",{"$f":"SUM(E55:E56)","v":2808.3390719999998},{"$f":"SUM(F55:F56)","v":2727.1345920000003},2580.9665279999999,1765.9299840000001,1393.2441599999997,1112.0202239999999]
[]
[]
[null,null,null,"Tarifas Trimestrales"]
{"$rows_left_out":24}
{"sheet":"Resumen tarifas anuales","index":2,"n_rows":69,"n_cols":9,"rows_kept":69,"cut":false,"hidden":false,"merged":[[1,2,1,8],[66,2,66,8],[67,2,67,8],[68,2,68,8],[22,2,22,8],[62,2,62,8],[26,2,26,8],[27,2,28,2],[23,2,23,3],[31,2,31,8],[47,2,47,8],[51,2,51,8],[6,3,6,8],[8,3,8,8],[14,1,14,2],[13,1,13,2],[16,3,16,8],[52,1,53,1],[56,2,56,8],[57,1,58,1],[63,2,64,8],[32,2,33,2],[48,1,48,2],[37,2,37,8],[38,2,39,8]]}
[]
[null,null,"Cotización de Seguro Médico Internacional - BUPA Guatemala"]
[]
[]
[null,null,null,null,null," "," "," "," "]
[]
[null,null,"Nombre del Asegurado:",{"$f":"+'INGRESO DE DATOS'!$D$14","v":"Nombre"}]
[]
[null,null,"Intermediario:",{"$f":"+'INGRESO DE DATOS'!$D$25","v":"Agente / Agencia"}]
[]
[null,null,"Fecha:",{"$f":"+TODAY()","v":"2023-07-25"},null,{"$f":"IF('INGRESO DE DATOS'!G20>0,\"Descuento\",\"\")","v":""},{"$f":"IF('INGRESO DE DATOS'!G20>0,'INGRESO DE DATOS'!G20,\"\")","v":""}]
[]
[null,null,null,null,"Numero de Adultos:",{"$f":"+'INGRESO DE DATOS'!$G$16","v":1},null,"Edad de Titular:",{"$f":"+'INGRESO DE DATOS'!$G$18","v":40}]
[]
[null,null,null,null,"Numero de Hijos:",{"$f":"+'INGRESO DE DATOS'!$J$16","v":0},null,"Edad de Conyuge:",{"$f":"+'INGRESO DE DATOS'!$J$18","v":46}]
[null,null,null,null,null," "," "," "]
[null,null,null,"DEDUCIBLES"]
[null,null,null,"PLAN 1","PLAN 2","PLAN 3","PLAN 4","PLAN 5","PLAN 6"]
[null,null,"Dentro del pais de residencia","n/a",1000,2000,5000,10000,20000]
[null,null,"Fuera del pais de residencia","n/a",2000,3000,5000,10000,20000]
[]
[]
[null,null,"TARIFAS ANUALES"]
[null,null,"Classic Care",null,{"$f":"+#REF!","v":{"$error":"#REF!"}},{"$f":"+#REF!","v":{"$error":"#REF!"}},{"$f":"+#REF!","v":{"$error":"#REF!"}},{"$f":"+#REF!","v":{"$error":"#REF!"}},{"$f":"+#REF!","v":{"$error":"#REF!"}}]
[]
[]
[null,null,"TARIFAS SEMIANUALES"]
[null,null,"Classic Care","1ra. Cuota",{"$f":"+#REF!","v":{"$error":"#REF!"}},{"$f":"+#REF!","v":{"$error":"#REF!"}},{"$f":"+#REF!","v":{"$error":"#REF!"}},{"$f":"+#REF!","v":{"$error":"#REF!"}},{"$f":"+#REF!","v":{"$error":"#REF!"}}]
[null,null,null,"2da. Cuota",{"$f":"+#REF!","v":{"$error":"#REF!"}},{"$f":"+#REF!","v":{"$error":"#REF!"}},{"$f":"+#REF!","v":{"$error":"#REF!"}},{"$f":"+#REF!","v":{"$error":"#REF!"}},{"$f":"+#REF!","v":{"$error":"#REF!"}}]
[null,null,null,"TOTAL",{"$f":"#REF!","v":{"$error":"#REF!"}},{"$f":"#REF!","v":{"$error":"#REF!"}},{"$f":"#REF!","v":{"$error":"#REF!"}},{"$f":"#REF!","v":{"$error":"#REF!"}},{"$f":"#REF!","v":{"$error":"#REF!"}}]
[]
[null,null,"TARIFAS TRIMESTRALES"]
[null,null,"Classic Care","1ra. Cuota",{"$f":"+#REF!","v":{"$error":"#REF!"}},{"$f":"+#REF!","v":{"$error":"#REF!"}},{"$f":"+#REF!","v":{"$error":"#REF!"}},{"$f":"+#REF!","v":{"$error":"#REF!"}},{"$f":"+#REF!","v":{"$error":"#REF!"}}]
[null,null,null,"2da. a 4ta. Cuota",{"$f":"+#REF!","v":{"$error":"#REF!"}},{"$f":"+#REF!","v":{"$error":"#REF!"}},{"$f":"+#REF!","v":{"$error":"#REF!"}},{"$f":"+#REF!","v":{"$error":"#REF!"}},{"$f":"+#REF!","v":{"$error":"#REF!"}}]
[null,null,null,"TOTAL",{"$f":"#REF!","v":{"$error":"#REF!"}},{"$f":"#REF!","v":{"$error":"#REF!"}},{"$f":"#REF!","v":{"$error":"#REF!"}},{"$f":"#REF!","v":{"$error":"#REF!"}},{"$f":"#REF!","v":{"$error":"#REF!"}}]
[]
[]
[null,null,"Tarifas en US $ -  Efectivas a partir del 1ro de enero de  2023"]
[null,null,"Este presupuesto solamente tiene carácter informativo y en ningún momento expresa compromiso legal para suministrarle cobertura de seguro. La emisión de una póliza de seguro Bupa está sujeta a todas las evaluaciones de riesgo por parte de Bupa y a la recepción de todos los pagos de prima requeridos."]
[]
[]
[]
[null,null,null,"PLAN 1","PLAN 2","PLAN 3","PLAN 4","PLAN 5","PLAN 6"]
[null,"Dentro del pais de residencia",null,250,250,1000,5000,10000,20000]
[null,"Fuera del pais de residencia",null,1000,5000,10000,5000,10000,20000]
[]
[]
[null,null,"TARIFAS ANUALES"]
[null,"Essential Care",null,{"$f":"'Essential Care'!E42","v":2654.1312000000003},{"$f":"'Essential Care'!F42","v":2577.5231999999996},{"$f":"'Essential Care'!G42","v":2439.6287999999995},{"$f":"'Essential Care'!H42","v":1670.7264},{"$f":"'Essential Care'!I42","v":1319.136},{"$f":"'Essential Care'!J42","v":1053.8304000000001}]
[]
[]
[null,null,"TARIFAS SEMIANUALES"]
[null,"Essential Care","1ra. Cuota",{"$f":"'Essential Care'!E55","v":1446.1695359999999},{"$f":"'Essential Care'!F55","v":1405.5672960000002},{"$f":"'Essential Care'!G55","v":1332.483264},{"$f":"'Essential Care'!H55","v":924.96499200000005},{"$f":"'Essential Care'!I55","v":738.62207999999987},{"$f":"'Essential Care'!J55","v":598.01011199999994}]
[null,null,"2da. Cuota",{"$f":"'Essential Care'!E56","v":1362.1695359999999},{"$f":"'Essential Care'!F56","v":1321.5672960000002},{"$f":"'Essential Care'!G56","v":1248.483264},{"$f":"'Essential Care'!H56","v":840.96499200000005},{"$f":"'Essential Care'!I56","v":654.62207999999987},{"$f":"'Essential Care'!J56","v":514.01011199999994}]
[null,null,"TOTAL",{"$f":"'Essential Care'!E57","v":2808.3390719999998},{"$f":"'Essential Care'!F57","v":2727.1345920000003},{"$f":"'Essential Care'!G57","v":2580.9665279999999},{"$f":"'Essential Care'!H57","v":1765.9299840000001},{"$f":"'Essential Care'!I57","v":1393.2441599999997},{"$f":"'Essential Care'!J57","v":1112.0202239999999}]
[]
[null,null,"TARIFAS TRIMESTRALES"]
[null,"Essential Care","1ra. Cuota",{"$f":"'Essential Care'!E71","v":790.78608000000008},{"$f":"'Essential Care'!F71","v":769.71888000000001},{"$f":"'Essential Care'!G71","v":731.79792000000009},{"$f":"'Essential Care'!H71","v":520.34976000000006},{"$f":"'Essential Care'!I71","v":423.66239999999999},{"$f":"'Essential Care'!J71","v":350.70336000000003}]
[null,null,"2da. a 4ta. Cuota",{"$f":"'Essential Care'!E72","v":706.78608000000008},{"$f":"'Essential Care'!F72","v":685.71888000000001},{"$f":"'Essential Care'!G72","v":647.79792000000009},{"$f":"'Essential Care'!H72","v":436.34976},{"$f":"'Essential Care'!I72","v":339.66239999999999},{"$f":"'Essential Care'!J72","v":266.70336000000003}]
[null,null,"TOTAL",{"$f":"'Essential Care'!E73","v":2911.1443200000003},{"$f":"'Essential Care'!F73","v":2826.8755200000001},{"$f":"'Essential Care'!G73","v":2675.1916800000004},{"$f":"'Essential Care'!H73","v":1829.39904},{"$f":"'Essential Care'!I73","v":1442.6496},{"$f":"'Essential Care'!J73","v":1150.8134400000001}]
{"$rows_left_out":10}
{"sheet":"Tablas","index":3,"n_rows":1133,"n_cols":24,"rows_kept":1133,"cut":false,"hidden":true,"merged":[[1062,0,1062,1],[1062,2,1062,6],[987,0,987,7],[988,0,988,1],[988,2,988,6],[1060,0,1060,7],[1061,0,1061,7],[952,0,952,7],[953,0,953,7],[954,0,954,1],[954,2,954,6],[986,0,986,7],[918,0,918,7],[919,0,919,7],[920,0,920,1],[920,2,920,6],[1,0,1,7],[2,0,2,7],[36,0,36,1],[36,2,36,6],[35,0,35,7],[3,0,3,1],[3,2,3,6],[135,0,135,7],[69,0,69,7],[70,0,70,1],[70,2,70,6],[203,0,203,7],[136,0,136,7],[137,0,137,1],[137,2,137,6],[169,0,169,7],[170,0,170,1],[68,0,68,7],[102,0,102,7],[103,0,103,1],[103,2,103,6],[342,0,342,7],[269,0,269,7],[270,0,270,7],[271,0,271,1],[271,2,271,6],[170,2,170,6],[202,0,202,7],[236,0,236,7],[237,0,237,1],[237,2,237,6],[204,0,204,1],[204,2,204,6],[628,0,628,7],[482,0,482,7],[483,0,483,7],[484,0,484,1],[484,2,484,6],[343,2,343,6],[415,0,415,7],[555,0,555,7],[556,0,556,1],[556,2,556,6],[343,0,343,1],[449,0,449,7],[450,0,450,1],[450,2,450,6],[416,0,416,7],[417,0,417,1],[417,2,417,6],[629,0,629,7],[630,0,630,1],[630,2,630,6],[701,0,701,7],[702,0,702,1],[702,2,702,6],[847,0,847,1],[847,2,847,6],[773,0,773,7],[774,0,774,7],[775,0,775,1],[775,2,775,6],[846,0,846,7]]}
[]
["BUPA COMPLETE GUATEMALA",null,null,null,null,null,null,null,null,"FACTOR SEMESTRAL :",null,0.53]
["TARIFAS ANUALES",null,null,null,null,null,null,null,"OK","FACTOR TRIMESTRAL :",null,0.27500000000000002]
["EDAD"]
[" "," ","DW1","DW2","DW3","DW4","DW5","DW6"]
[18,"-  24",12140,7386,5058,3643,2581,1973,null,"Descuento (15%)",null,0.72]
[25,"-  29",12747,7738,5616,4048,2833,2176]
[30,"-  34",13305,8094,6019,4504,3442,2633]
[35,"-  39",14871,9056,6728,5058,3846,2936]
[40,"-  44",16844,10520,7386,5616,4250,3238]
[45,"-  49",18817,11736,8246,6272,4756,3643]
[50,"-  54",24836,15326,10876,8246,6780,5213]
[55,"-  59",26403,16337,11583,8801,7233,5514]
[60,null,28022,17754,12596,10015,8600,6929]
[61,null,30096,19068,13507,10724,9258,7437]
[62,null,32928,20889,14771,11736,10115,8143]
[63,null,35003,22205,15730,12495,10775,8649]
[64,null,37886,24026,16996,13507,11635,9359]
[65,null,39704,31412,22205,17097,15529,13201]
[66,null,41475,36519,25797,19878,18059,15326]
[67,null,45320,39858,28174,21698,19727,16743]
[68,null,50125,44156,31207,24026,21851,18564]
[69,null,55130,48558,34294,26454,24026,20383]
[70,null,65249,59785,41778,31106,27971,23975]
[71,null,67829,62112,43400,32322,29085,24937]
[72,null,69750,63882,44662,33232,29893,25645]
[73,null,72279,66209,46282,34447,31005,26606]
[74,null,73593,67424,47091,35104,31562,27061]
[75,"o más",76781,70357,49163,36619,32928,28224]
[1,"Hijo",2270,4097,1872,1469,1266,911]
[2,"Hijos",3566,6424,2985,2329,1973,1469]
[3,"Hijos o más",5193,9359,4351,3442,2883,2127]
[1,"Rider Comp. Maternidad",0,0,0,225,225,225]
[1,"Transplante de organos",0,0,0,0,0,0]
[]
["TARIFAS SEMESTRALES "]
["EDAD"]
[" "," ","DW1","DW2","DW3","DW4","DW5","DW6"]
[18,"-  24",4135.59,3251.55,2226.5300000000002,1603.78,1135.79,868.1400000000001]
[25,"-  29",4342.29,3406.84,2472.4500000000003,1781.8600000000001,1247.0900000000001,957.71]
[30,"-  34",4532.0300000000007,3563.19,2650,1982.73,1514.74,1158.5800000000002]
[35,"-  39",5066.2700000000004,3986.6600000000003,2961.6400000000003,2226.5300000000002,1692.8200000000002,1292.1400000000001]
[40,"-  44",5738.31,4631.67,3251.55,2472.4500000000003,1870.3700000000001,1425.17]
[45,"-  49",6410.35,5166.97,3629.9700000000003,2761.3,2093.5,1603.78]
[50,"-  54",8460.92,6747.43,4788.0200000000004,3629.9700000000003,2984.4300000000003,2294.37]
[55,"-  59",8994.630000000001,7192.63,5099.66,3874.8300000000004,3184.2400000000002,2427.4]
[60,null,9546.36,7816.4400000000005,5545.39,4409.0700000000006,3785.79,3050.6800000000003]
[61,null,10252.85,8395.2000000000007,5946.6,4721.2400000000007,4075.7000000000003,3273.81]
[62,null,11217.980000000001,9197.09,6503.1,5166.97,4453.0600000000004,3584.92]
[63,null,11924.470000000001,9775.85,6925.51,5500.87,4743.5,3808.05]
[64,null,12906.560000000001,10577.74,7482.54,5946.6,5122.45,4120.22]
[65,null,13526.66,13829.820000000002,9775.85,7527.06,6837,5811.9800000000005]
[66,null,14129.800000000001,16078.61,11357.37,8751.8900000000012,7950.5300000000007,6747.43]
[67,null,15439.43,17548.830000000002,12404.12,9553.25,8685.11,7371.2400000000007]
[68,null,17076.600000000002,19440.93,13739.720000000001,10577.74,9620.5600000000013,8173.13]
[69,null,18782.14,21379.14,15098.640000000001,11646.75,10577.74,8973.9600000000009]
[70,null,22228.73,26322.45,18394.18,13695.2,12315.08,10555.480000000001]
[71,null,23107.47,27346.940000000002,19108.09,14230.5,12805.33,10978.95]
[72,null,23762.550000000003,28126.57,19663.530000000002,14631.18,13160.960000000001,11290.59]
[73,null,24623.800000000003,29150.530000000002,20376.91,15165.95,13651.210000000001,11713.53]
{"$rows_left_out":1073}